user_id,username,last_name,username,email,user_nicename,last_name,first_name,display_name,billing_last_name,billing_first_name,billing_email,billing_company,billing_address_1,billing_postcode,billing_city,billing_state,billing_address_2,billing_country,billing_phone,billing_fax,shipping_last_name,shipping_first_name,shipping_company,shipping_address_1,shipping_address_2,shipping_postcode,shipping_city,shipping_state,shipping_country,shipping_phone
10454,`Cassandra,Roberts,`CassandraRoberts,lilly_85@live.com,`Cassandra,Roberts,`Cassandra,`Cassandra,Roberts,`Cassandra,lilly_85@live.com,,108 Monfarville st,2760,St Marys,,,Australia,416426048,,Roberts,`Cassandra,,108 Monfarville st,,2760,St Marys,,Australia,416426048
2901,Aaron,Davis,AaronDavis,aarondavis91@y7mail.com,Aaron,Davis,Aaron,Aaron,Davis,Aaron,aarondavis91@y7mail.com,,14 Fisher Street,2199,Yagoona,,,Australia,421748211,,Davis,Aaron,,14 Fisher Street,,2199,Yagoona,,Australia,421748211
3904,Aaron,Fyfe,AaronFyfe,fyfe.aaron@bigpond.com,Aaron,Fyfe,Aaron,Aaron,Fyfe,Aaron,fyfe.aaron@bigpond.com,,11 Woodland Court,4503,Murrumba Downs,,,Australia,439946226,,Fyfe,Aaron,,11 Woodland Court,,4503,Murrumba Downs,,Australia,439946226
10070,Aarti,Vasoya,AartiVasoya,aartiv80@hotmail.com,Aarti,Vasoya,Aarti,Aarti,Vasoya,Aarti,aartiv80@hotmail.com,,74 Eton Street,4700,Rockhampton,,West Rockhampton,Australia,61749211081,,Vasoya,Aarti,,74 Eton Street,West Rockhampton,4700,Rockhampton,,Australia,61749211081
2809,abbey,Dodds,abbeyDodds,abbey-may@hotmail.com,abbey,Dodds,abbey,abbey,Dodds,abbey,abbey-may@hotmail.com,,19/5-11 Samuel Terry Ave,2033,Kensington,,,Australia,400488318,,Dodds,abbey,,19/5-11 Samuel Terry Ave,,2033,Kensington,,Australia,400488318
1508,Abbey,Harden,AbbeyHarden,abstar95@hotmail.com,Abbey,Harden,Abbey,Abbey,Harden,Abbey,abstar95@hotmail.com,,38 Elkhorn Street,4558,Kuluin,,,Australia,418462093,,Harden,Abbey,,38 Elkhorn Street,,4558,Kuluin,,Australia,418462093
3475,Abbie,Chapman,AbbieChapman,abbielouisewoods@gmail.com,Abbie,Chapman,Abbie,Abbie,Chapman,Abbie,abbielouisewoods@gmail.com,,26 Honour Ave,3024,Melbourne,,Wyndham Vale,Australia,419825961,,Chapman,Abbie,,26 Honour Ave,Wyndham Vale,3024,Melbourne,,Australia,419825961
5805,Abbie,Guzzi,AbbieGuzzi,abbiesalter@hotmail.com,Abbie,Guzzi,Abbie,Abbie,Guzzi,Abbie,abbiesalter@hotmail.com,,15 juane park drive,3089,Diamond Creek,,,Australia,421154134,,Guzzi,Abbie,,15 juane park drive,,3089,Diamond Creek,,Australia,421154134
9673,Abbie,Speed,AbbieSpeed,Abbie.speed@mail.com,Abbie,Speed,Abbie,Abbie,Speed,Abbie,Abbie.speed@mail.com,,17 Makybe drive,6171,Rockingham,,Baldivis,Australia,416603911,,Speed,Abbie,,17 Makybe drive,Baldivis,6171,Rockingham,,Australia,416603911
10558,Abby,brooks,Abbybrooks,abby_93_7@hotmail.com,Abby,brooks,Abby,Abby,brooks,Abby,abby_93_7@hotmail.com,anby brooks,110 satoris road lymwood,7256,lymwood,,King island,Australia,455897821,,brooks,Abby,anby brooks,110 satoris road lymwood,King island,7256,lymwood,,Australia,455897821
3313,abby,carman,abbycarman,gemmichael@hotmail.com,abby,carman,abby,abby,carman,abby,gemmichael@hotmail.com,,4 charlottes cove rd,7112,charlotte cove,,,Australia,61417564633,61417564633,carman,abby,,4 charlottes cove rd,,7112,charlotte cove,,Australia,61417564633
7455,Abby,Davidson,AbbyDavidson,abbydavo@hotmail.com,Abby,Davidson,Abby,Abby,Davidson,Abby,abbydavo@hotmail.com,,84 Nasmyth Street,2594,Young,,,Australia,402622105,,Davidson,Abby,,84 Nasmyth Street,,2594,Young,,Australia,402622105
7053,Abby,McClintock,AbbyMcClintock,abbymcclintock@hotmail.com,Abby,McClintock,Abby,Abby,McClintock,Abby,abbymcclintock@hotmail.com,,14 Centenary Ave,2652,Tarcutta,,,Australia,406963758,,McClintock,Abby,,14 Centenary Ave,,2652,Tarcutta,,Australia,406963758
4837,Abby,Palmer,AbbyPalmer,nonnik8@gmail.com,Abby,Palmer,Abby,Abby,Palmer,Abby,nonnik8@gmail.com,,30 Budgen Street,810,Moil,,,Australia,409040571,,Palmer,Abby,,30 Budgen Street,,810,Moil,,Australia,409040571
10096,Abi,Bird,AbiBird,abibird147@gmail.com,Abi,Bird,Abi,Abi,Bird,Abi,abibird147@gmail.com,,48 First Ave,2068,Willoughby East,,,Australia,417489852,,Bird,Abi,,48 First Ave,,2068,Willoughby East,,Australia,417489852
8007,Abi,Chambers,AbiChambers,Abigail.chambers76@hotmail.co.uk,Abi,Chambers,Abi,Abi,Chambers,Abi,Abigail.chambers76@hotmail.co.uk,,107 Hargreaves Road,4154,Brisbane,,Manly West,Australia,432105520,,Chambers,Abi,,107 Hargreaves Road,Manly West,4154,Brisbane,,Australia,432105520
12088,Abigail,Murison,AbigailMurison,amurison@gmail.com,Abigail,Murison,Abigail,Abigail,Murison,Abigail,amurison@gmail.com,Edge,Level 1,3000,Melbourne,,103 Lonsdale St,Australia,415039299,,Murison,Abigail,Edge,Level 1,103 Lonsdale St,3000,Melbourne,,Australia,415039299
11759,Ada,Kwok,AdaKwok,akwok2004@yahoo.com.au,Ada,Kwok,Ada,Ada,Kwok,Ada,akwok2004@yahoo.com.au,,12 Faussett st,3206,Albert Park,,,Australia,402947857,,Kwok,Ada,,12 Faussett st,,3206,Albert Park,,Australia,402947857
11800,adam,limerick,adamlimerick,o41697484o@gmail.com,adam,limerick,adam,adam,limerick,adam,o41697484o@gmail.com,,48 mosman loop,6164,success,,,Australia,405600485,,limerick,adam,,48 mosman loop,,6164,success,,Australia,405600485
11335,Adam,Wecker,AdamWecker,wecker_adam@hotmail.com,Adam,Wecker,Adam,Adam,Wecker,Adam,wecker_adam@hotmail.com,,94 Carinyan Drive,4159,Brisbane,,Birkdale,Australia,404512432,,Wecker,Adam,,94 Carinyan Drive,Birkdale,4159,Brisbane,,Australia,404512432
8596,Adele,Brown,AdeleBrown,adelehb@hotmail.com,Adele,Brown,Adele,Adele,Brown,Adele,adelehb@hotmail.com,,2/118 Sturt Street,3564,Echuca,,,Australia,418498404,,Brown,Adele,,2/118 Sturt Street,,3564,Echuca,,Australia,418498404
5656,Adele,Deverell,AdeleDeverell,adeledeverell@live.com.au,Adele,Deverell,Adele,Adele,Deverell,Adele,adeledeverell@live.com.au,,6 Elizabeth Court,3658,Waterford Park,,,Australia,431304042,,Deverell,Adele,,6 Elizabeth Court,,3658,Waterford Park,,Australia,431304042
11092,Adele,Dichiera,AdeleDichiera,kidsthreadsandtrends@hotmail.com,Adele,Dichiera,Adele,Adele,Dichiera,Adele,kidsthreadsandtrends@hotmail.com,C/- Auto One Niddrie,511-515 Keilor Rd,3042,NIDDRIE,,,Australia,0408 312 662,,Dichiera,Adele,C/- Auto One Niddrie,511-515 Keilor Rd,,3042,NIDDRIE,,Australia,0408 312 662
4285,Adele,Dichiera Luca,AdeleDichiera Luca,adeledichiera@hotmail.com,Adele,Dichiera Luca,Adele,Adele,Dichiera Luca,Adele,adeledichiera@hotmail.com,C/- AUTO ONE NIDDRIE,511 Keilor Road,3042,NIDDRIE,,ATT: Simon Luca,Australia,0408 312 662,,Dichiera Luca,Adele,C/- AUTO ONE NIDDRIE,511 Keilor Road,ATT: Simon Luca,3042,NIDDRIE,,Australia,0408 312 662
3819,Adele,Rudd,AdeleRudd,deljrudd@gmail.com,Adele,Rudd,Adele,Adele,Rudd,Adele,deljrudd@gmail.com,,10/17-19 Page St,2145,Wentworthville,,,Australia,405144011,,Rudd,Adele,,10/17-19 Page St,,2145,Wentworthville,,Australia,405144011
1030,Adelle,Green,AdelleGreen,ronald.adelle.green@bigpond.com.au,Adelle,Green,Adelle,Adelle,Green,Adelle,ronald.adelle.green@bigpond.com.au,,10 Gibbs Street,4509,Brisbane,,North lakes,Australia,07 34805979,,Green,Adelle,,10 Gibbs Street,North lakes,4509,Brisbane,,Australia,07 34805979
2105,Adreana,Latimer,AdreanaLatimer,bandangel@hotmail.com,Adreana,Latimer,Adreana,Adreana,Latimer,Adreana,bandangel@hotmail.com,,20 Torresdale Rd,3752,South Morang,,,Australia,405139134,,Latimer,Adreana,,20 Torresdale Rd,,3752,South Morang,,Australia,405139134
10002,Adriana,Pangas,AdrianaPangas,adrianapangas@outlook.com,Adriana,Pangas,Adriana,Adriana,Pangas,Adriana,adrianapangas@outlook.com,,8 Short St,2335,North Rothbury,,,Australia,428234350,,Pangas,Adriana,,8 Short St,,2335,North Rothbury,,Australia,428234350
4573,Adriana,Pangas,AdrianaPangas,bjandap@livecom.au,Adriana,Pangas,Adriana,Adriana,Pangas,Adriana,bjandap@livecom.au,,Flamingo,2877,Condobolin,,Palisthan Road,Australia,268962258,268962278,Pangas,Adriana,,Flamingo,Palisthan Road,2877,Condobolin,,Australia,268962258
3491,Adriana,Pangas,AdrianaPangas,bjandap@live.com.au,Adriana,Pangas,Adriana,Adriana,Pangas,Adriana,bjandap@live.com.au,,Flamingo,2877,Condobolin,,Palisthan Road,Australia,268962258,,Pangas,Adriana,,Flamingo,Palisthan Road,2877,Condobolin,,Australia,268962258
874,Adrianne,Antich,AdrianneAntich,pauladdy@bigpond.net.au,Adrianne,Antich,Adrianne,Adrianne,Antich,Adrianne,pauladdy@bigpond.net.au,,41 Cranfield Drive,4556,Buderim,,,Australia,754770779,,Antich,Adrianne,,41 Cranfield Drive,,4556,Buderim,,Australia,754770779
5646,Adrienne,Eastwood,AdrienneEastwood,Adroeastwood@gmail.com,Adrienne,Eastwood,Adrienne,Adrienne,Eastwood,Adrienne,Adroeastwood@gmail.com,,21 Blue Mountain Crescent,4500,Brisbane,,Warner,Australia,416300302,,Eastwood,Adrienne,,21 Blue Mountain Crescent,Warner,4500,Brisbane,,Australia,416300302
1487,Adrienne,Seery,AdrienneSeery,Seery@wn.com.au,Adrienne,Seery,Adrienne,Adrienne,Seery,Adrienne,Seery@wn.com.au,,3 Cornish Avenue,6026,Perth,,Woodvale,Australia,439910183,,Seery,Adrienne,,3 Cornish Avenue,Woodvale,6026,Perth,,Australia,439910183
8547,Afroula,Hzaife,AfroulaHzaife,aff.bill@hotmail.com,Afroula,Hzaife,Afroula,Afroula,Hzaife,Afroula,aff.bill@hotmail.com,,13 Monaro Close,2176,SYDNEY,,,Australia,410799006,,Hzaife,Afroula,,13 Monaro Close,,2176,SYDNEY,,Australia,410799006
9588,Agnes,Wild,AgnesWild,aitok@hotmail.com,Agnes,Wild,Agnes,Agnes,Wild,Agnes,aitok@hotmail.com,,18 Anchor Court,3028,Seabrook,,,Australia,408661311,,Wild,Agnes,,18 Anchor Court,,3028,Seabrook,,Australia,408661311
4093,Agnieszka,Kendrick,AgnieszkaKendrick,petek87au@yahoo.com.au,Agnieszka,Kendrick,Agnieszka,Agnieszka,Kendrick,Agnieszka,petek87au@yahoo.com.au,,7 Henley Circuit,5169,Seaford Rise,,,Australia,403039625,,Kendrick,Agnieszka,,7 Henley Circuit,,5169,Seaford Rise,,Australia,403039625
4613,Aiden,Robertson,AidenRobertson,aiden.robertson@hotmail.com,Aiden,Robertson,Aiden,Aiden,Robertson,Aiden,aiden.robertson@hotmail.com,,PO Box 503,5355,NURIOOTPA,,,Australia,435209205,,Robertson,Aiden,,PO Box 503,,5355,NURIOOTPA,,Australia,435209205
5615,Aileen,Kingston,AileenKingston,tigajess@gmail.com,Aileen,Kingston,Aileen,Aileen,Kingston,Aileen,tigajess@gmail.com,,2600 Mayfield Rd,2580,Tarago,,,Australia,408746582,,Kingston,Aileen,,2600 Mayfield Rd,,2580,Tarago,,Australia,408746582
5011,ailsa,carruthers,ailsacarruthers,ailsajohnny@westnet.com.au,ailsa,carruthers,ailsa,ailsa,carruthers,ailsa,ailsajohnny@westnet.com.au,,242 Hancock st,6018,perth,,Doubleview,Australia,434913320,,carruthers,ailsa,,242 Hancock st,Doubleview,6018,perth,,Australia,434913320
10793,Aimee,Akkermans,AimeeAkkermans,aimeelongo@gmail.com,Aimee,Akkermans,Aimee,Aimee,Akkermans,Aimee,aimeelongo@gmail.com,,8 Acacia drive,3500,mildura,,,Australia,409173123,,Akkermans,Aimee,,8 Acacia drive,,3500,mildura,,Australia,409173123
4874,Aimee,Barnett,AimeeBarnett,aimztar@yahoo.com.au,Aimee,Barnett,Aimee,Aimee,Barnett,Aimee,aimztar@yahoo.com.au,,3/28 breakwater rd,3219,East Geelong,,,Australia,402836744,,Barnett,Aimee,,3/28 breakwater rd,,3219,East Geelong,,Australia,402836744
9139,Aimee,Bartolo,AimeeBartolo,aimeebartolo@hotmail.com,Aimee,Bartolo,Aimee,Aimee,Bartolo,Aimee,aimeebartolo@hotmail.com,,232A Forest Rd,2227,Gymea,,,Australia,402200490,,Bartolo,Aimee,,232A Forest Rd,,2227,Gymea,,Australia,402200490
4956,aimee,breeze,aimeebreeze,aimeebreeze@live.com,aimee,breeze,aimee,aimee,breeze,aimee,aimeebreeze@live.com,,4 napper close,2577,moss vale,,,Australia,423908835,,breeze,aimee,,4 napper close,,2577,moss vale,,Australia,423908835
7987,Aimee,Bristow,AimeeBristow,chicken_doodle@live.com.au,Aimee,Bristow,Aimee,Aimee,Bristow,Aimee,chicken_doodle@live.com.au,,28 Elizabeth Crescent,2835,Cobar,,,Australia,431041150,,Bristow,Aimee,,28 Elizabeth Crescent,,2835,Cobar,,Australia,431041150
10431,Aimee,Busuttil,AimeeBusuttil,Aimeebusuttil27@dodo.com.au,Aimee,Busuttil,Aimee,Aimee,Busuttil,Aimee,Aimeebusuttil27@dodo.com.au,,16 Links Ave,2214,Sydney,,Milperra,Australia,427544074,,Busuttil,Aimee,,16 Links Ave,Milperra,2214,Sydney,,Australia,427544074
8112,Aimee,Crainie,AimeeCrainie,aimeecrainie@yahoo.com.au,Aimee,Crainie,Aimee,Aimee,Crainie,Aimee,aimeecrainie@yahoo.com.au,,7 Marden Grange,6069,Aveley,,,Australia,417802987,,Crainie,Aimee,,7 Marden Grange,,6069,Aveley,,Australia,417802987
6745,aimee,Davison,aimeeDavison,aimeedavison@me.com,aimee,Davison,aimee,aimee,Davison,aimee,aimeedavison@me.com,,4/66 glorious promenade,4302,Brisbane,,,Australia,449858582,,Davison,aimee,,4/66 glorious promenade,,4302,Brisbane,,Australia,449858582
9512,Aimee,Doggett,AimeeDoggett,aimee.doggett@hotmail.com,Aimee,Doggett,Aimee,Aimee,Doggett,Aimee,aimee.doggett@hotmail.com,,5 Emu Road,6112,Perth,,,Australia,415980817,,Doggett,Aimee,,5 Emu Road,,6112,Perth,,Australia,415980817
1081,Aimee,Duffy,AimeeDuffy,aimee_pears@hotmail.com,Aimee,Duffy,Aimee,Aimee,Duffy,Aimee,aimee_pears@hotmail.com,,1 Currant Ave,7253,George Town,,,Australia,426208745,,Duffy,Aimee,,1 Currant Ave,,7253,George Town,,Australia,426208745
10503,Aimee,Engelmann,AimeeEngelmann,aimee@beepo.com.au,Aimee,Engelmann,Aimee,Aimee,Engelmann,Aimee,aimee@beepo.com.au,,32 Twigg Street,4068,Indooroopilly,,,Australia,61407332906,,Engelmann,Aimee,,32 Twigg Street,,4068,Indooroopilly,,Australia,61407332906
11443,Aimee,Evans,AimeeEvans,heath.aimee@hotmail.co.nz,Aimee,Evans,Aimee,Aimee,Evans,Aimee,heath.aimee@hotmail.co.nz,,31 Branchton Loop,6171,Perth,,Baldivis,Australia,414830155,,Evans,Aimee,,31 Branchton Loop,Baldivis,6171,Perth,,Australia,414830155
6902,Aimee,Hannah,AimeeHannah,Aimeehannah93@hotmail.com,Aimee,Hannah,Aimee,Aimee,Hannah,Aimee,Aimeehannah93@hotmail.com,,5 prince street,2213,Sydney,,Picnic point,Australia,418160834,,Hannah,Aimee,,5 prince street,Picnic point,2213,Sydney,,Australia,418160834
3723,Aimee,Martin,AimeeMartin,Aimeeemartin@gmail.com,Aimee,Martin,Aimee,Aimee,Martin,Aimee,Aimeeemartin@gmail.com,,202 Gladesville Blvd,3197,Patterson Lakes,,,Australia,417690288,,Martin,Aimee,,202 Gladesville Blvd,,3197,Patterson Lakes,,Australia,417690288
7904,Aimee,Sloan,AimeeSloan,ang3lsloan@yahoo.com.au,Aimee,Sloan,Aimee,Aimee,Sloan,Aimee,ang3lsloan@yahoo.com.au,,11 Roycroft Close,5168,Noarlunga Downs,,,Australia,433967787,,Sloan,Aimee,,11 Roycroft Close,,5168,Noarlunga Downs,,Australia,433967787
2644,Aimee,Whittaker,AimeeWhittaker,aimee.whittaker@hotmail.com,Aimee,Whittaker,Aimee,Aimee,Whittaker,Aimee,aimee.whittaker@hotmail.com,,24 Cleveland street,2285,Cameron park,,,Australia,400865244,,Whittaker,Aimee,,24 Cleveland street,,2285,Cameron park,,Australia,400865244
8573,Aimee-Louise,Higgins,Aimee-LouiseHiggins,aimeehiggins83@hotmail.com,Aimee-Louise,Higgins,Aimee-Louise,Aimee-Louise,Higgins,Aimee-Louise,aimeehiggins83@hotmail.com,,2/11 McPherson Court,2484,Murwillumbah,,,Australia,412679363,,Higgins,Aimee-Louise,,2/11 McPherson Court,,2484,Murwillumbah,,Australia,412679363
10267,Ainsley,Ablett,AinsleyAblett,merryainsley@yahoo.com.au,Ainsley,Ablett,Ainsley,Ainsley,Ablett,Ainsley,merryainsley@yahoo.com.au,,63 Drummond Gdns,6056,Helena Valley,,,Australia,418923907,,Ablett,Ainsley,,63 Drummond Gdns,,6056,Helena Valley,,Australia,418923907
6723,Ainsley,Lebner,AinsleyLebner,ainsleylebner@hotmail.com,Ainsley,Lebner,Ainsley,Ainsley,Lebner,Ainsley,ainsleylebner@hotmail.com,,"83, Oxford Drive",2640,Thurgoona,,,Australia,0416 765 775,,Lebner,Ainsley,,"83, Oxford Drive",,2640,Thurgoona,,Australia,0416 765 775
1311,Ainsley,Vandenbergh,AinsleyVandenbergh,avandenbergh@ausgrid.com.au,Ainsley,Vandenbergh,Ainsley,Ainsley,Vandenbergh,Ainsley,avandenbergh@ausgrid.com.au,,4 Mountain View Parade,2305,New Lambton Heights,,,Australia,412668567,,Vandenbergh,Ainsley,,4 Mountain View Parade,,2305,New Lambton Heights,,Australia,412668567
9285,Ainslie,Fiene,AinslieFiene,Ainslie_taylor@hotmail.com,Ainslie,Fiene,Ainslie,Ainslie,Fiene,Ainslie,Ainslie_taylor@hotmail.com,,66 Elkhorn Street,4051,Brisbane,,Enoggera,Australia,415977951,,Fiene,Ainslie,,66 Elkhorn Street,Enoggera,4051,Brisbane,,Australia,415977951
4465,Aisha,Danjani,AishaDanjani,aishadanjani@hotmail.com,Aisha,Danjani,Aisha,Aisha,Danjani,Aisha,aishadanjani@hotmail.com,,58 Oyster Bay Road,2225,Oyster Bay,,,Australia,424894425,,Danjani,Aisha,,58 Oyster Bay Road,,2225,Oyster Bay,,Australia,424894425
2011,Ajadee,Geck,AjadeeGeck,ajadee1@bigpond.com,Ajadee,Geck,Ajadee,Ajadee,Geck,Ajadee,ajadee1@bigpond.com,,8 Tea Tree Place,4305,Raceview,,,Australia,416867007,,Geck,Ajadee,,8 Tea Tree Place,,4305,Raceview,,Australia,416867007
7606,Ala,Power,AlaPower,ala-power@hotmail.com,Ala,Power,Ala,Ala,Power,Ala,ala-power@hotmail.com,,80 Quakers hill parkway,2763,Sydney,,Quakers hill,Australia,410619397,,Power,Ala,,80 Quakers hill parkway,Quakers hill,2763,Sydney,,Australia,410619397
7661,Alaina,Frost,AlainaFrost,alaina@adam.com.au,Alaina,Frost,Alaina,Alaina,Frost,Alaina,alaina@adam.com.au,,205 Black Rd,5159,Flagstaff Hill,,,Australia,403977317,,Frost,Alaina,,205 Black Rd,,5159,Flagstaff Hill,,Australia,403977317
1386,alaina,o'brien,alainao'brien,alaina81@live.com.au,alaina,o'brien,alaina,alaina,o'brien,alaina,alaina81@live.com.au,,5 Sassafras,4500,warner,,court,Australia,411333494,,o'brien,alaina,,5 Sassafras,court,4500,warner,,Australia,411333494
6464,Alana,Ashford,AlanaAshford,lushrat@westnet.com.au,Alana,Ashford,Alana,Alana,Ashford,Alana,lushrat@westnet.com.au,,126 Mundoo Road,4860,Innisfail,,,Australia,498126530,,Ashford,Alana,,126 Mundoo Road,,4860,Innisfail,,Australia,498126530
9766,Alana,Ashford,AlanaAshford,luckylush1978@gmail.com,Alana,Ashford,Alana,Alana,Ashford,Alana,luckylush1978@gmail.com,,PO Box 1456,4860,Innisfail,,,Australia,498126530,,Ashford,Alana,,PO Box 1456,,4860,Innisfail,,Australia,498126530
11448,Alana,Betts,AlanaBetts,alana.betts@hotmail.com,Alana,Betts,Alana,Alana,Betts,Alana,alana.betts@hotmail.com,,19 Disney St,4053,Stafford Heights,,,Australia,402519966,,Betts,Alana,,19 Disney St,,4053,Stafford Heights,,Australia,402519966
10866,Alana,Coupland,AlanaCoupland,Alana_Coupland@hotmail.com.au,Alana,Coupland,Alana,Alana,Coupland,Alana,Alana_Coupland@hotmail.com.au,,15 Hills street,2594,Young,,,Australia,409122869,,Coupland,Alana,,15 Hills street,,2594,Young,,Australia,409122869
818,Alana,Cullen,AlanaCullen,alana.cullen@bigpond.com,Alana,Cullen,Alana,Alana,Cullen,Alana,alana.cullen@bigpond.com,,24 Grand South Cct,4300,Springfield Lakes,,,Australia,411419266,,Cullen,Alana,,24 Grand South Cct,,4300,Springfield Lakes,,Australia,411419266
10572,Alana,Cutler,AlanaCutler,welchalana@hotmail.com,Alana,Cutler,Alana,Alana,Cutler,Alana,welchalana@hotmail.com,,61 Beeville Road,4502,Petrie,,,Australia,438460190,,Cutler,Alana,,61 Beeville Road,,4502,Petrie,,Australia,438460190
2168,Alana,Davies,AlanaDavies,goosa71@bigpond.net.au,Alana,Davies,Alana,Alana,Davies,Alana,goosa71@bigpond.net.au,,16 Linderberg St,4670,Bundaberg,,,Australia,741515004,,Davies,Alana,,16 Linderberg St,,4670,Bundaberg,,Australia,741515004
11703,Alana,Dowdle,AlanaDowdle,Vixon84@msn.com,Alana,Dowdle,Alana,Alana,Dowdle,Alana,Vixon84@msn.com,,15 Newhaven Tce,5110,Burton,,,Australia,401346783,,Dowdle,Alana,,15 Newhaven Tce,,5110,Burton,,Australia,401346783
11936,alana,duncker,alanaduncker,alana.duncker@gmail.com,alana,duncker,alana,alana,duncker,alana,alana.duncker@gmail.com,,56 Glendale Ave,5159,Flagstaff Hill,,,Australia,417384980,,duncker,alana,,56 Glendale Ave,,5159,Flagstaff Hill,,Australia,417384980
7797,Alana,Dwyer,AlanaDwyer,frangapani79@hotmail.com,Alana,Dwyer,Alana,Alana,Dwyer,Alana,frangapani79@hotmail.com,,9 Laffan court,3331,Bannockburn,,,Australia,352811464,,Dwyer,Alana,,9 Laffan court,,3331,Bannockburn,,Australia,352811464
10872,Alana,Hands,AlanaHands,alanahands@ymail.com,Alana,Hands,Alana,Alana,Hands,Alana,alanahands@ymail.com,,7 Colorado ave,4065,Bardon,,,Australia,431341235,,Hands,Alana,,7 Colorado ave,,4065,Bardon,,Australia,431341235
2986,Alana,Herbert,AlanaHerbert,aj_herbert@hotmail.com,Alana,Herbert,Alana,Alana,Herbert,Alana,aj_herbert@hotmail.com,,22 Riverside Drive,4680,Tannum Sands,,,Australia,402629829,,Herbert,Alana,,22 Riverside Drive,,4680,Tannum Sands,,Australia,402629829
5601,Alana,Linke,AlanaLinke,alana.linke@hotmail.com,Alana,Linke,Alana,Alana,Linke,Alana,alana.linke@hotmail.com,,3 Dampier court,4124,Boronia Heights,,,Australia,435939573,,Linke,Alana,,3 Dampier court,,4124,Boronia Heights,,Australia,435939573
9059,Alana,Muscat,AlanaMuscat,ap.muscat@bigpond.com,Alana,Muscat,Alana,Alana,Muscat,Alana,ap.muscat@bigpond.com,,PO Box 330,4753,Marian,,,Australia,439786046,,Muscat,Alana,,PO Box 330,,4753,Marian,,Australia,439786046
3964,alana,print,alanaprint,99pinkbunnys@gmail.com,alana,print,alana,alana,print,alana,99pinkbunnys@gmail.com,,9 Holroyd way,6432,boulder,,,Australia,61406224819,61406224819,print,alana,,9 Holroyd way,,6432,boulder,,Australia,61406224819
11103,Alana,Reid,AlanaReid,alanamitchell@hotmail.com,Alana,Reid,Alana,Alana,Reid,Alana,alanamitchell@hotmail.com,,40 carisbrook cct,4078,Forest Lake,,,Australia,412236522,,Reid,Alana,,40 carisbrook cct,,4078,Forest Lake,,Australia,412236522
8417,Alana,Thurstans,AlanaThurstans,alana.thurstans@henryschein.com.au,Alana,Thurstans,Alana,Alana,Thurstans,Alana,alana.thurstans@henryschein.com.au,,38 Browning Avenue,5024,Fulham Gardens,,,Australia,457786748,,Thurstans,Alana,,38 Browning Avenue,,5024,Fulham Gardens,,Australia,457786748
7379,Alana,Tyson,AlanaTyson,alana.donlan@optusnet.com.au,Alana,Tyson,Alana,Alana,Tyson,Alana,alana.donlan@optusnet.com.au,,10 Ayles Rd,2153,Winston Hills,,,Australia,425235661,,Tyson,Alana,,10 Ayles Rd,,2153,Winston Hills,,Australia,425235661
11581,Alana,Vaughan,AlanaVaughan,Alanavaughan@icloud.com,Alana,Vaughan,Alana,Alana,Vaughan,Alana,Alanavaughan@icloud.com,,4 kookaburra place,2232,Grays point,,,Australia,431970113,,Vaughan,Alana,,4 kookaburra place,,2232,Grays point,,Australia,431970113
9440,Alanah,Stokoe,AlanahStokoe,Alanahstokoe@hotmail.com,Alanah,Stokoe,Alanah,Alanah,Stokoe,Alanah,Alanahstokoe@hotmail.com,,12 Amery Road,6065,Perth,,Hocking,Australia,450091465,,Stokoe,Alanah,,12 Amery Road,Hocking,6065,Perth,,Australia,450091465
7081,Alanna,Hartog,AlannaHartog,aml1982@live.com.au,Alanna,Hartog,Alanna,Alanna,Hartog,Alanna,aml1982@live.com.au,,278 Moriarty Road,7307,Latrobe,,,Australia,61447954624,61447954624,Hartog,Alanna,,278 Moriarty Road,,7307,Latrobe,,Australia,61447954624
5136,alanna,healy,alannahealy,allanandali@yahoo.com.au,alanna,healy,alanna,alanna,healy,alanna,allanandali@yahoo.com.au,,p.o box 3420,4551,caloundra bc,,,Australia,61414545090,61414545090,healy,alanna,,p.o box 3420,,4551,caloundra bc,,Australia,61414545090
3617,Alannah,Noffke,AlannahNoffke,Alannah.dominy@hotmail.com,Alannah,Noffke,Alannah,Alannah,Noffke,Alannah,Alannah.dominy@hotmail.com,,7-11 Gilead Court,4280,Jimboomba,,,Australia,422735576,,Noffke,Alannah,,7-11 Gilead Court,,4280,Jimboomba,,Australia,422735576
6407,Alayne,Parker,AlayneParker,enyala87@gmail.com,Alayne,Parker,Alayne,Alayne,Parker,Alayne,enyala87@gmail.com,OzAmber,8 Greggor Street,4178,Wynnum West,,,Australia,61410190280,61410190280,Parker,Alayne,OzAmber,8 Greggor Street,,4178,Wynnum West,,Australia,61410190280
10702,Alea,Giudice,AleaGiudice,Alea.185@hotmail.com,Alea,Giudice,Alea,Alea,Giudice,Alea,Alea.185@hotmail.com,,3 Batavia place,6530,Geraldton,,,Australia,411842556,,Giudice,Alea,,3 Batavia place,,6530,Geraldton,,Australia,411842556
3749,Alecia,Corlett,AleciaCorlett,aleciacorlett@hotmail.com,Alecia,Corlett,Alecia,Alecia,Corlett,Alecia,aleciacorlett@hotmail.com,,62 New Settlement Road,4505,Burpengary,,,Australia,738883149,,Corlett,Alecia,,62 New Settlement Road,,4505,Burpengary,,Australia,738883149
11064,ALECIA,WEBB,ALECIAWEBB,webb1ale@gmail.com,ALECIA,WEBB,ALECIA,ALECIA,WEBB,ALECIA,webb1ale@gmail.com,,26 Berne St,2261,Bateau Bay,,,Australia,403436954,,WEBB,ALECIA,,26 Berne St,,2261,Bateau Bay,,Australia,403436954