username,email,user_nicename,last_name,first_name,display_name,billing_last_name,billing_first_name,billing_email,billing_company,billing_address_1,billing_postcode,billing_city,billing_state,billing_address_2,billing_country,billing_phone,billing_fax,shipping_last_name,shipping_first_name,shipping_company,shipping_address_1,shipping_address_2,shipping_postcode,shipping_city,shipping_state,shipping_country,shipping_phone
dee.abear@news.com.au,dee.abear@news.com.au,Dee,A'Bear,Dee,Dee,A'Bear,Dee,dee.abear@news.com.au,News Queensland- CareerOne,Cnr Mayne and Campbell Streets,4006,Brisbane,,Bowen Hills,Australia,412460230,,A'Bear,Dee,News Queensland- CareerOne,Cnr Mayne and Campbell Streets,Bowen Hills,4006,Brisbane,,Australia,412460230
alikatjewels@Gmail.com,alikatjewels@Gmail.com,tina,aaaaahh,tina,tina,aaaaahh,tina,alikatjewels@Gmail.com,,11 aaaaa,3000,hhfgyy,,,Australia,0,,aaaaahh,tina,,11 aaaaa,,3000,hhfgyy,,Australia,
azyrati_erma@yahoo.com,azyrati_erma@yahoo.com,AZYRATI,AB RAHMAN,AZYRATI,AZYRATI,AB RAHMAN,AZYRATI,azyrati_erma@yahoo.com,,26 CREEKVIEW DR,4680,GLADSTONE,,GLADSTONE,Australia,61428100008,,AB RAHMAN,AZYRATI,,26 CREEKVIEW DR,GLADSTONE,4680,GLADSTONE,,Australia,61428100008
ashlee.abbott@gmail.com,ashlee.abbott@gmail.com,Ashlee,Abbott,Ashlee,Ashlee,Abbott,Ashlee,ashlee.abbott@gmail.com,,87 Wommara Ave,2280,Belmont North,,,Australia,423740360,,Abbott,Ashlee,,87 Wommara Ave,,2280,Belmont North,,Australia,423740360
clarekabbott@gmail.com,clarekabbott@gmail.com,Clare,Abbott,Clare,Clare,Abbott,Clare,clarekabbott@gmail.com,,2/11A Lauderdale Avenue,2094,Fairlight,,,Australia,431825619,,Abbott,Clare,,2/11A Lauderdale Avenue,,2094,Fairlight,,Australia,431825619
Chick_a_deno1@hotmail.com,Chick_a_deno1@hotmail.com,Emma,Abbott,Emma,Emma,Abbott,Emma,Chick_a_deno1@hotmail.com,,7 cataract place,2560,Leumeah,,,Australia,408461840,,Abbott,Emma,,7 cataract place,,2560,Leumeah,,Australia,408461840
nicole@nicoleabbott.com.au,nicole@nicoleabbott.com.au,nicole,abbott,nicole,nicole,abbott,nicole,nicole@nicoleabbott.com.au,,26 cambridge st,5167,Port Noarlunga South,,26 Cambridge Street,Australia,61408280389,61408280389,abbott,nicole,,26 cambridge st,26 Cambridge Street,5167,Port Noarlunga South,,Australia,61408280389
Elaine-abbott@bigpond.com,Elaine-abbott@bigpond.com,Sharna,Abbott,Sharna,Sharna,Abbott,Sharna,Elaine-abbott@bigpond.com,,5857 brand highway,6503,Gingin,,,Australia,428521012,,Abbott,Sharna,,5857 brand highway,,6503,Gingin,,Australia,428521012
Dadoo_mahmoud@hotmail.com,Dadoo_mahmoud@hotmail.com,Doaa,abdallah,Doaa,Doaa,abdallah,Doaa,Dadoo_mahmoud@hotmail.com,,15 dunnell street,6109,maddington,,,Australia,406468250,,abdallah,Doaa,,15 dunnell street,,6109,maddington,,Australia,406468250
Kathy.abdilla@swahs.health.nsw.gov.au,Kathy.abdilla@swahs.health.nsw.gov.au,Kathy,Abdilla,Kathy,Kathy,Abdilla,Kathy,Kathy.abdilla@swahs.health.nsw.gov.au,,17 domus street,2747,Mulgoa,,,Australia,434496422,,Abdilla,Kathy,,17 domus street,,2747,Mulgoa,,Australia,434496422
Renastar16@gmail.com,Renastar16@gmail.com,Serena,Abdul,Serena,Serena,Abdul,Serena,Renastar16@gmail.com,,67 clear island road,4218,Broadbeach waters,,,Australia,423514812,,Abdul,Serena,,67 clear island road,,4218,Broadbeach waters,,Australia,423514812
kabel79@hotmail.com,kabel79@hotmail.com,kellie,abel,kellie,kellie,abel,kellie,kabel79@hotmail.com,,20 Albion Road,7030,Bridgewater,,,Australia,448810557,,abel,kellie,,20 Albion Road,,7030,Bridgewater,,Australia,448810557
niki75@optusnet.com.au,niki75@optusnet.com.au,Niki,Abela,Niki,Niki,Abela,Niki,niki75@optusnet.com.au,,25 Kirrawee Ave,2232,Sydney,,Kirrawee,Australia,438657459,,Abela,Niki,,25 Kirrawee Ave,Kirrawee,2232,Sydney,,Australia,438657459
jennifer.abercromby@gmail.com,jennifer.abercromby@gmail.com,Jennifer,Abercromby,Jennifer,Jennifer,Abercromby,Jennifer,jennifer.abercromby@gmail.com,,40 Kidston Ave,4740,Rural View,,,Australia,447015700,,Abercromby,Jennifer,,40 Kidston Ave,,4740,Rural View,,Australia,447015700
merryainsley@yahoo.com.au,merryainsley@yahoo.com.au,Ainsley,Ablett,Ainsley,Ainsley,Ablett,Ainsley,merryainsley@yahoo.com.au,,63 Drummond Gdns,6056,Helena Valley,,,Australia,418923907,,Ablett,Ainsley,,63 Drummond Gdns,,6056,Helena Valley,,Australia,418923907
abraham.family13@gmail.com,abraham.family13@gmail.com,Karen,Abraham,Karen,Karen,Abraham,Karen,abraham.family13@gmail.com,,1 Mengel Court,4350,Middle Ridge,,,Australia,409095126,,Abraham,Karen,,1 Mengel Court,,4350,Middle Ridge,,Australia,409095126
kellieabraham@hotmail.com,kellieabraham@hotmail.com,Kellie,Abraham,Kellie,Kellie,Abraham,Kellie,kellieabraham@hotmail.com,,6 Saxon Drive,3138,Melbourne,,Mooroolbark,Australia,450695531,,Abraham,Kellie,,6 Saxon Drive,Mooroolbark,3138,Melbourne,,Australia,450695531
Neeshaan@hotmail.com,Neeshaan@hotmail.com,Neeshaan,Abrahams,Neeshaan,Neeshaan,Abrahams,Neeshaan,Neeshaan@hotmail.com,,6 Bottlebrush Avenue,2560,Sydney,,Bradbury,Australia,0420 660983,,Abrahams,Neeshaan,,6 Bottlebrush Avenue,Bradbury,2560,Sydney,,Australia,0420 660983
Kathryn.abram@gmail.com,Kathryn.abram@gmail.com,Kathryn,Abram,Kathryn,Kathryn,Abram,Kathryn,Kathryn.abram@gmail.com,,98 flinders street,3071,Thornbury,,,Australia,408121156,,Abram,Kathryn,,98 flinders street,,3071,Thornbury,,Australia,408121156
jjbabramo@gmail.com,jjbabramo@gmail.com,jessica,Abramo,jessica,jessica,Abramo,jessica,jjbabramo@gmail.com,,29 Chandala Turn,6069,Ellenbrook,,,Australia,892969298,,Abramo,jessica,,29 Chandala Turn,,6069,Ellenbrook,,Australia,892969298
belindaabrams@optusnet.com.au,belindaabrams@optusnet.com.au,Belinda,Abrams,Belinda,Belinda,Abrams,Belinda,belindaabrams@optusnet.com.au,,95 Murray Road,3136,Croydon,,,Australia,425320291,,Abrams,Belinda,,95 Murray Road,,3136,Croydon,,Australia,425320291
becabrams@gmail.com,becabrams@gmail.com,rebecca,abrams,rebecca,rebecca,abrams,rebecca,becabrams@gmail.com,,63 federation street,6016,perth,,mt hawthorn,Australia,0404 437 432,,abrams,rebecca,,63 federation street,mt hawthorn,6016,perth,,Australia,0404 437 432
Amanda.J.Acheson@det.nsw.edu.au,Amanda.J.Acheson@det.nsw.edu.au,Amanda,Acheson,Amanda,Amanda,Acheson,Amanda,Amanda.J.Acheson@det.nsw.edu.au,,86 Farrand Street,2871,FORBES,,,Australia,431332199,,Acheson,Amanda,,86 Farrand Street,,2871,FORBES,,Australia,431332199
anita@ackermanfamily.com.au,anita@ackermanfamily.com.au,Anita,Ackerman,Anita,Anita,Ackerman,Anita,anita@ackermanfamily.com.au,,22 First Avenue,2068,Willoughby East,,,Australia,402939412,,Ackerman,Anita,,22 First Avenue,,2068,Willoughby East,,Australia,402939412
kackers79@gmail.com,kackers79@gmail.com,Kelly,Ackers,Kelly,Kelly,Ackers,Kelly,kackers79@gmail.com,,43 Squadron Cr,2320,Rutherford,,Rutherford,Australia,438403341,,Ackers,Kelly,,43 Squadron Cr,Rutherford,2320,Rutherford,,Australia,438403341
Kay_kayz@hotmail.com,Kay_kayz@hotmail.com,Kayla,Ackland,Kayla,Kayla,Ackland,Kayla,Kay_kayz@hotmail.com,,18/60 Quinliven road,5173,Adelaide,,Aldinga beach,Australia,410909554,,Ackland,Kayla,,18/60 Quinliven road,Aldinga beach,5173,Adelaide,,Australia,410909554
skatila1@hotmail.com,skatila1@hotmail.com,Sharmin,Adaggra,Sharmin,Sharmin,Adaggra,Sharmin,skatila1@hotmail.com,,107 Burlington Street,2065,Crows Nest,,,Australia,415755149,,Adaggra,Sharmin,,107 Burlington Street,,2065,Crows Nest,,Australia,415755149
Sar_sullivan@yahoo.com.au,Sar_sullivan@yahoo.com.au,Sarah,Adair,Sarah,Sarah,Adair,Sarah,Sar_sullivan@yahoo.com.au,,37 Linden Ave,3081,Heidelberg heights,,,Australia,402281526,,Adair,Sarah,,37 Linden Ave,,3081,Heidelberg heights,,Australia,402281526
lulufrances@gmail.com,lulufrances@gmail.com,Laura,Adam,Laura,Laura,Adam,Laura,lulufrances@gmail.com,,28A Kinsella St,2620,Karabar,,,Australia,439769168,,Adam,Laura,,28A Kinsella St,,2620,Karabar,,Australia,439769168
paulnmeg@yahoo.com.au,paulnmeg@yahoo.com.au,Meggan,Adam,Meggan,Meggan,Adam,Meggan,paulnmeg@yahoo.com.au,,Dysart,2873,Tottenham,,,Australia,429924155,,Adam,Meggan,,Dysart,,2873,Tottenham,,Australia,429924155
Anamclennan@yahoo.com.au,Anamclennan@yahoo.com.au,Ana,Adams,Ana,Ana,Adams,Ana,Anamclennan@yahoo.com.au,,3 Irving Avenue,3181,Prahran East,,,Australia,413901202,,Adams,Ana,,3 Irving Avenue,,3181,Prahran East,,Australia,413901202
anne.adams@me.com,anne.adams@me.com,Anne,Adams,Anne,Anne,Adams,Anne,anne.adams@me.com,Bundoora Endoscopy,119 Plenty Road,3083,Bumdoora,,,Australia,419569763,,Adams,Anne,Bundoora Endoscopy,119 Plenty Road,,3083,Bumdoora,,Australia,419569763
bern.mick@bigpond.com,bern.mick@bigpond.com,Bernadette,Adams,Bernadette,Bernadette,Adams,Bernadette,bern.mick@bigpond.com,,1/461 Kaitlers Rd Lavington,2641,Albury,,,Australia,02 60254492,,Adams,Bernadette,,1/461 Kaitlers Rd Lavington,,2641,Albury,,Australia,02 60254492
dcadams25@gmail.com,dcadams25@gmail.com,Denise,Adams,Denise,Denise,Adams,Denise,dcadams25@gmail.com,,25 Levis Street,3630,Shepparton,,,Australia,358224045,,Adams,Denise,,25 Levis Street,,3630,Shepparton,,Australia,358224045
dee_adams86@live.com.au,dee_adams86@live.com.au,Diane,Adams,Diane,Diane,Adams,Diane,dee_adams86@live.com.au,,12 Macquarie Drive,3024,Melbourne,,Wyndham Vale,Australia,413723986,,Adams,Diane,,12 Macquarie Drive,Wyndham Vale,3024,Melbourne,,Australia,413723986
jca_1907@hotmail.com,jca_1907@hotmail.com,Jade,Adams,Jade,Jade,Adams,Jade,jca_1907@hotmail.com,,9 London LInk,6164,Aubin Grove,,,Australia,411156088,,Adams,Jade,,9 London LInk,,6164,Aubin Grove,,Australia,411156088
shaunlizelle@bigpond.com,shaunlizelle@bigpond.com,Lizelle,Adams,Lizelle,Lizelle,Adams,Lizelle,shaunlizelle@bigpond.com,,45 Wimborne Avenue,3930,Mount Eliza,,,Australia,0420 308 955,,Adams,Lizelle,,45 Wimborne Avenue,,3930,Mount Eliza,,Australia,0420 308 955
garg22@bigpond.com,garg22@bigpond.com,rachelle,adams,rachelle,rachelle,adams,rachelle,garg22@bigpond.com,,11 scenic terrrace,3752,south morang,,,Australia,414889703,,adams,rachelle,,11 scenic terrrace,,3752,south morang,,Australia,414889703
adams.nae@gmail.com,adams.nae@gmail.com,Renee,Adams,Renee,Renee,Adams,Renee,adams.nae@gmail.com,,52 verri st,2680,Griffith,,,Australia,423684513,,Adams,Renee,,52 verri st,,2680,Griffith,,Australia,423684513
sal_ando@hotmail.com,sal_ando@hotmail.com,Sal,Adams,Sal,Sal,Adams,Sal,sal_ando@hotmail.com,,2 rive view rd,2107,Sydney,,Avalon,Australia,439333004,,Adams,Sal,,2 rive view rd,Avalon,2107,Sydney,,Australia,439333004
sarah.jenner2@gmail.com,sarah.jenner2@gmail.com,Sarah,Adams,Sarah,Sarah,Adams,Sarah,sarah.jenner2@gmail.com,,37 Panorama Road Calala,2340,Tamworth,,,Australia,(02)67621712,,Adams,Sarah,,37 Panorama Road Calala,,2340,Tamworth,,Australia,(02)67621712
trayb@hotmail.com,trayb@hotmail.com,tracy,adams,tracy,tracy,adams,tracy,trayb@hotmail.com,,3 garland rise,3178,melbourne,,rowville,Australia,417055431,,adams,tracy,,3 garland rise,rowville,3178,melbourne,,Australia,417055431
jadeadamsanderson@gmail.com,jadeadamsanderson@gmail.com,Jade,Adams Anderson,Jade,Jade,Adams Anderson,Jade,jadeadamsanderson@gmail.com,,539 Raymond terrace rd,2322,Chisholm,,,Australia,401901107,,Adams Anderson,Jade,,539 Raymond terrace rd,,2322,Chisholm,,Australia,401901107
javl@picknowl.com.au,javl@picknowl.com.au,Jane,Adamson,Jane,Jane,Adamson,Jane,javl@picknowl.com.au,,7 Bergomi Court,4207,Brisbane,,Eagleby,Australia,0417 541 369,,Adamson,Jane,,7 Bergomi Court,Eagleby,4207,Brisbane,,Australia,0417 541 369
jadamson@middlemountcoal.com.au,jadamson@middlemountcoal.com.au,Jo,Adamson,Jo,Jo,Adamson,Jo,jadamson@middlemountcoal.com.au,,25 Heinrich Street,4207,Mount Warren Park,,,Australia,433715876,,Adamson,Jo,,25 Heinrich Street,,4207,Mount Warren Park,,Australia,433715876
nosmada_87@hotmail.com,nosmada_87@hotmail.com,Lauren,Adamson,Lauren,Lauren,Adamson,Lauren,nosmada_87@hotmail.com,,9 Rowan Walk,3818,Drouin,,,Australia,408054263,,Adamson,Lauren,,9 Rowan Walk,,3818,Drouin,,Australia,408054263
danniellepower@live.com.au,danniellepower@live.com.au,Dannielle,Adamthwaite,Dannielle,Dannielle,Adamthwaite,Dannielle,danniellepower@live.com.au,,7 Drinan St,2335,Branxton,,,Australia,423953007,,Adamthwaite,Dannielle,,7 Drinan St,,2335,Branxton,,Australia,423953007
Lainie.d@gmail.com,Lainie.d@gmail.com,Lainie,Addinell,Lainie,Lainie,Addinell,Lainie,Lainie.d@gmail.com,,163 College Way,4034,Boondall,,,Australia,405947176,,Addinell,Lainie,,163 College Way,,4034,Boondall,,Australia,405947176
texdesign@iprimus.com.ua,texdesign@iprimus.com.ua,Tex,Adi,Tex,Tex,Adi,Tex,texdesign@iprimus.com.ua,,1 Montrose Street,3414,Dimboola,,,Australia,403870720,,Adi,Tex,,1 Montrose Street,,3414,Dimboola,,Australia,403870720
Lauren.adlam@gmail.com,Lauren.adlam@gmail.com,Lauren,Adlam,Lauren,Lauren,Adlam,Lauren,Lauren.adlam@gmail.com,,3 Bapaume rd,2088,Mosman,,,Australia,438357177,,Adlam,Lauren,,3 Bapaume rd,,2088,Mosman,,Australia,438357177
corbinadler.05@gmail.com,corbinadler.05@gmail.com,Tammy,Adler,Tammy,Tammy,Adler,Tammy,corbinadler.05@gmail.com,,68 vanilla ave,4503,Griffin,,,Australia,404812992,,Adler,Tammy,,68 vanilla ave,,4503,Griffin,,Australia,404812992
miz_superstar@hotmail.com,miz_superstar@hotmail.com,Haroula,Afantenou,Haroula,Haroula,Afantenou,Haroula,miz_superstar@hotmail.com,,134 Dawson Road,4122,Upper Mt Gravatt,,,Australia,401478773,,Afantenou,Haroula,,134 Dawson Road,,4122,Upper Mt Gravatt,,Australia,401478773
andersons66@hotmail.com,andersons66@hotmail.com,Carolina,Affonso,Carolina,Carolina,Affonso,Carolina,andersons66@hotmail.com,,2/66 West Burleigh rd,4220,Gold Coat,,Burleigh Heads,Australia,407287536,,Affonso,Carolina,,2/66 West Burleigh rd,Burleigh Heads,4220,Gold Coat,,Australia,407287536
karlzb@gmail.com,karlzb@gmail.com,Karlie,agius,Karlie,Karlie,agius,Karlie,karlzb@gmail.com,,30a hollybush way,6111,Kelmscott,,,Australia,409370317,,agius,Karlie,,30a hollybush way,,6111,Kelmscott,,Australia,409370317
becalee79@hotmail.com,becalee79@hotmail.com,bec,Agland,bec,bec,Agland,bec,becalee79@hotmail.com,,18 Discovery Drive,2287,Fletcher,,,Australia,415991415,,Agland,bec,,18 Discovery Drive,,2287,Fletcher,,Australia,415991415
nicola.agnew@wdslimited.com.au,nicola.agnew@wdslimited.com.au,Nicola,Agnew,Nicola,Nicola,Agnew,Nicola,nicola.agnew@wdslimited.com.au,,31 Quoll Circuit,4509,North Lakes,,,Australia,433930082,,Agnew,Nicola,,31 Quoll Circuit,,4509,North Lakes,,Australia,433930082
michelleagnoleto@me.com,michelleagnoleto@me.com,Michelle,Agnoleto,Michelle,Michelle,Agnoleto,Michelle,michelleagnoleto@me.com,,90 Canterbury Road,3206,Middle Park,,,Australia,414084689,,Agnoleto,Michelle,,90 Canterbury Road,,3206,Middle Park,,Australia,414084689
Sayrah.ahkit88@hotmail.com,Sayrah.ahkit88@hotmail.com,Sayrah,Ah Kit,Sayrah,Sayrah,Ah Kit,Sayrah,Sayrah.ahkit88@hotmail.com,,10 Glencoe Cres Tiwi,810,Darwin,,,Australia,416563647,,Ah Kit,Sayrah,,10 Glencoe Cres Tiwi,,810,Darwin,,Australia,416563647
courtneylahearn@gmail.com,courtneylahearn@gmail.com,Courtney,Ahearn,Courtney,Courtney,Ahearn,Courtney,courtneylahearn@gmail.com,,74/1 Bridgman Drive,4227,Reedy Creek,,,Australia,418373684,,Ahearn,Courtney,,74/1 Bridgman Drive,,4227,Reedy Creek,,Australia,418373684
vinjac08@hotmail.com,vinjac08@hotmail.com,Jacki,Ahern,Jacki,Jacki,Ahern,Jacki,vinjac08@hotmail.com,,9 Kakadu Cres,4119,Underwood,,,Australia,409876795,,Ahern,Jacki,,9 Kakadu Cres,,4119,Underwood,,Australia,409876795
snjezana.ahlgren@gmail.com,snjezana.ahlgren@gmail.com,Snjezana,Ahlgren,Snjezana,Snjezana,Ahlgren,Snjezana,snjezana.ahlgren@gmail.com,,25 Burt Street,3018,Melbourne,,Altona,Australia,424320384,,Ahlgren,Snjezana,,25 Burt Street,Altona,3018,Melbourne,,Australia,424320384
claudia_aiello@hotmail.com,claudia_aiello@hotmail.com,Claudia,Aiello,Claudia,Claudia,Aiello,Claudia,claudia_aiello@hotmail.com,,81 Oxley Drive,2079,Mt.Colah,,,Australia,422415525,,Aiello,Claudia,,81 Oxley Drive,,2079,Mt.Colah,,Australia,422415525
ilea_ant@hotmail.com,ilea_ant@hotmail.com,Natalie,Aikman,Natalie,Natalie,Aikman,Natalie,ilea_ant@hotmail.com,,14 Woollard Crescent,4352,Cabarlah,,Borneo Barracks,Australia,422985776,,Aikman,Natalie,,14 Woollard Crescent,Borneo Barracks,4352,Cabarlah,,Australia,422985776
jhar70@hotmail.com,jhar70@hotmail.com,Julie,Aimer,Julie,Julie,Aimer,Julie,jhar70@hotmail.com,,"Unit 1, 24 Banksia Street",2099,Sydney,,Dee Why,Australia,413363981,,Aimer,Julie,,"Unit 1, 24 Banksia Street",Dee Why,2099,Sydney,,Australia,413363981
daitchison67@yahoo.co.uk,daitchison67@yahoo.co.uk,Debbie,Aitchison,Debbie,Debbie,Aitchison,Debbie,daitchison67@yahoo.co.uk,,43 Blackall Road,4503,Murrumba Downs,,,Australia,3888 9500,,Aitchison,Debbie,,43 Blackall Road,,4503,Murrumba Downs,,Australia,3888 9500
janet@overlandplumbing.net.au,janet@overlandplumbing.net.au,Janet,Aitken,Janet,Janet,Aitken,Janet,janet@overlandplumbing.net.au,,1 Pinehurst Crt,812,Marrara,,,Australia,409510437,,Aitken,Janet,,1 Pinehurst Crt,,812,Marrara,,Australia,409510437
kelli_aitken@hotmail.com,kelli_aitken@hotmail.com,Kelli,Aitken,Kelli,Kelli,Aitken,Kelli,kelli_aitken@hotmail.com,,5 Elphick Street,6110,Gosnells,,,Australia,893983451,,Aitken,Kelli,,5 Elphick Street,,6110,Gosnells,,Australia,893983451
Kellind78@hotmail.com,Kellind78@hotmail.com,Kelly,Aitken,Kelly,Kelly,Aitken,Kelly,Kellind78@hotmail.com,,29 Kesiya Turn,6164,Aubin Grove,,,Australia,447375292,,Aitken,Kelly,,29 Kesiya Turn,,6164,Aubin Grove,,Australia,447375292
wenlocksdj@hotmail.com,wenlocksdj@hotmail.com,Sheila,Aitken,Sheila,Sheila,Aitken,Sheila,wenlocksdj@hotmail.com,,124/22 Hansford Road,4216,Coombabah,,,Australia,438951734,,Aitken,Sheila,,124/22 Hansford Road,,4216,Coombabah,,Australia,438951734
melsta123@bigpond.com,melsta123@bigpond.com,Melissa,Aitkin,Melissa,Melissa,Aitkin,Melissa,melsta123@bigpond.com,,1 Avalon Avenue,4817,Kirwan,,,Australia,417608482,,Aitkin,Melissa,,1 Avalon Avenue,,4817,Kirwan,,Australia,417608482
lia70@bigpond.com,lia70@bigpond.com,Lia,Aivatoglou,Lia,Lia,Aivatoglou,Lia,lia70@bigpond.com,,24 Elizabeth St,3144,Malvern,,,Australia,412022678,412022678,Aivatoglou,Lia,,24 Elizabeth St,,3144,Malvern,,Australia,412022678
zelderina@hotmail.com,zelderina@hotmail.com,Zoe,Akeroyd,Zoe,Zoe,Akeroyd,Zoe,zelderina@hotmail.com,,4 Meston St,4053,Brisbane,,Mitchelton,Australia,401185514,,Akeroyd,Zoe,,4 Meston St,Mitchelton,4053,Brisbane,,Australia,401185514
tamaraakers@hotmail.com,tamaraakers@hotmail.com,Tamara,Akers,Tamara,Tamara,Akers,Tamara,tamaraakers@hotmail.com,,25 Coldstream St,6007,West Leederville,,,Australia,439090696,,Akers,Tamara,,25 Coldstream St,,6007,West Leederville,,Australia,439090696
aimeelongo@gmail.com,aimeelongo@gmail.com,Aimee,Akkermans,Aimee,Aimee,Akkermans,Aimee,aimeelongo@gmail.com,,8 Acacia drive,3500,mildura,,,Australia,409173123,,Akkermans,Aimee,,8 Acacia drive,,3500,mildura,,Australia,409173123
manal004@hotmail.com,manal004@hotmail.com,Manal,Al,Manal,Manal,Al,Manal,manal004@hotmail.com,,"7 Doris St, Picnic Point",2213,Sydney,,,Australia,413037393,,Al,Manal,,"7 Doris St, Picnic Point",,2213,Sydney,,Australia,413037393
meredithjanealbert@gmail.com,meredithjanealbert@gmail.com,Meredith,Albert,Meredith,Meredith,Albert,Meredith,meredithjanealbert@gmail.com,,2 morotai street,4825,Mount Isa,,,Australia,432144205,,Albert,Meredith,,2 morotai street,,4825,Mount Isa,,Australia,432144205
Davidandvickialbert@gmail.com,Davidandvickialbert@gmail.com,Vicki,Albert,Vicki,Vicki,Albert,Vicki,Davidandvickialbert@gmail.com,,37 Kardinia Road,2088,Mosman,,,Australia,400196506,,Albert,Vicki,,37 Kardinia Road,,2088,Mosman,,Australia,400196506
ajalbury@gmail.com,ajalbury@gmail.com,Amanda,Albury,Amanda,Amanda,Albury,Amanda,ajalbury@gmail.com,,24 Boboli Way,6065,Pearsall,,,Australia,0409 090 419,,Albury,Amanda,,24 Boboli Way,,6065,Pearsall,,Australia,0409 090 419
seanalderson@bigpond.com,seanalderson@bigpond.com,Amanda,Alderson,Amanda,Amanda,Alderson,Amanda,seanalderson@bigpond.com,,5 Holstein Close,2750,Emu Heights,,,Australia,414351474,,Alderson,Amanda,,5 Holstein Close,,2750,Emu Heights,,Australia,414351474
courtneyalderson@gmail.com,courtneyalderson@gmail.com,Courtney,Alderson,Courtney,Courtney,Alderson,Courtney,courtneyalderson@gmail.com,,3 Rigelsford St,2567,Mount Annan,,,Australia,420981880,,Alderson,Courtney,,3 Rigelsford St,,2567,Mount Annan,,Australia,420981880
Dorothy_le@hotmail.com,Dorothy_le@hotmail.com,Dorothy,Aldous,Dorothy,Dorothy,Aldous,Dorothy,Dorothy_le@hotmail.com,,728 Burwood Road,3123,Hawthorn East,,,Australia,421059665,,Aldous,Dorothy,,728 Burwood Road,,3123,Hawthorn East,,Australia,421059665
lindamouat@bigpond.com,lindamouat@bigpond.com,Carmel,Aldridge,Carmel,Carmel,Aldridge,Carmel,lindamouat@bigpond.com,,1/55 Bultarra Crescent,4817,Townsville,,Kirwan,Australia,407508470,,Aldridge,Carmel,,1/55 Bultarra Crescent,Kirwan,4817,Townsville,,Australia,407508470
carmel82@dodo.com.au,carmel82@dodo.com.au,Carmel,Aldridge,Carmel,Carmel,Aldridge,Carmel,carmel82@dodo.com.au,,1/55 Bultarra Crescent,4817,Townsville,,Kirwan,Australia,407508470,,Aldridge,Carmel,,1/55 Bultarra Crescent,Kirwan,4817,Townsville,,Australia,407508470
alessisa@bigpond.com,alessisa@bigpond.com,Sandra,Alessio,Sandra,Sandra,Alessio,Sandra,alessisa@bigpond.com,,40 fauna road,2759,Erskine park,,,Australia,02-96705705,,Alessio,Sandra,,40 fauna road,,2759,Erskine park,,Australia,02-96705705
warrior_heart@live.com.au,warrior_heart@live.com.au,jazz,alexander,jazz,jazz,alexander,jazz,warrior_heart@live.com.au,,3/113 punt road,3181,windsor,,,Australia,434837473,,alexander,jazz,,3/113 punt road,,3181,windsor,,Australia,434837473
haveyouseen@live.com.au,haveyouseen@live.com.au,Jazz,Alexander,Jazz,Jazz,Alexander,Jazz,haveyouseen@live.com.au,,3/113 punt road,3181,windsor,,,Australia,434837473,,Alexander,Jazz,,3/113 punt road,,3181,windsor,,Australia,434837473
marissa.alexander@bigpond.com,marissa.alexander@bigpond.com,Marissa,Alexander,Marissa,Marissa,Alexander,Marissa,marissa.alexander@bigpond.com,,9 Woodstork Close,2261,Tumbi Umbi,,,Australia,61450909272,61450909272,Alexander,Marissa,,9 Woodstork Close,,2261,Tumbi Umbi,,Australia,61450909272
shelleya225@gmail.com,shelleya225@gmail.com,michelle,alexander,michelle,michelle,alexander,michelle,shelleya225@gmail.com,,162 bilga crescant,2036,sydney,,malabar,Australia,415945892,,alexander,michelle,,162 bilga crescant,malabar,2036,sydney,,Australia,415945892
bec.alexander@gmail.com,bec.alexander@gmail.com,Rebecca,Alexander,Rebecca,Rebecca,Alexander,Rebecca,bec.alexander@gmail.com,,15 Swan Ave,5159,Happy Valley,,,Australia,408412224,,Alexander,Rebecca,,15 Swan Ave,,5159,Happy Valley,,Australia,408412224
aa.rebecca@live.com.au,aa.rebecca@live.com.au,Rebecca,Alexander,Rebecca,Rebecca,Alexander,Rebecca,aa.rebecca@live.com.au,,27 usher blvd,4519,beerwah,,,Australia,458988105,,Alexander,Rebecca,,27 usher blvd,,4519,beerwah,,Australia,458988105
shanshan4@bigpond.com,shanshan4@bigpond.com,Shannon,Alexander,Shannon,Shannon,Alexander,Shannon,shanshan4@bigpond.com,,12 Lumley Drive,3741,Bright,,,Australia,407861575,,Alexander,Shannon,,12 Lumley Drive,,3741,Bright,,Australia,407861575
shazalex83@bigpond.com,shazalex83@bigpond.com,Sharon,Alexander,Sharon,Sharon,Alexander,Sharon,shazalex83@bigpond.com,,4 Lark Crt,4815,Condon,,,Australia,407690376,,Alexander,Sharon,,4 Lark Crt,,4815,Condon,,Australia,407690376
claregilder76@hotmail.com,claregilder76@hotmail.com,Clare,Alexandrou,Clare,Clare,Alexandrou,Clare,claregilder76@hotmail.com,,29 Wilohurst Drive,4165,Redland Bay,,,Australia,400003944,,Alexandrou,Clare,,29 Wilohurst Drive,,4165,Redland Bay,,Australia,400003944
shayleejarron9@hotmail.com,shayleejarron9@hotmail.com,Shaylee,algie,Shaylee,Shaylee,algie,Shaylee,shayleejarron9@hotmail.com,,2 dwyer crt,3584,Swan hill,,,Australia,4970924098,,algie,Shaylee,,2 dwyer crt,,3584,Swan hill,,Australia,4970924098
matakia@Gmail.com,matakia@Gmail.com,athena,ali,athena,athena,ali,athena,matakia@Gmail.com,,14 Brennan dve,3152,wantirna stg,,,Australia,0,,ali,athena,,14 Brennan dve,,3152,wantirna stg,,Australia,0